{"text_format":"1","workbook":"xlsx","n_sheets":14,"sheets":["Contact and Other Information","ContactData","Program","ProgramData","Performance","PerformanceData","Annual Financial Report","AFRData","Performance Metrics","Quality Checklist ","Transfer Worksheet","Categories","Code","Best Practices"],"not_rendered":{"charts":0,"images":0,"macros":1,"external_links":2,"defined_names":9,"comments":0,"pivot_tables":0},"unopened":[],"bounds":{"document_bytes":16777216,"sheet_cells":100000,"rows_first":2000,"rows_last":500,"rows_between":2000,"halvings":0,"cell_chars":16384,"cell_head_chars":4096},"cells_cut":0,"cells_raw":0,"read":"whole","date_system":"1900"}

{"sheet":"Contact and Other Information","index":0,"n_rows":43,"n_cols":12,"rows_kept":43,"cut":false,"hidden":false,"merged":[[19,8,20,8],[23,6,23,9],[0,1,0,7],[11,1,13,2],[18,0,18,3],[17,1,17,3],[11,0,13,0],[3,0,5,0],[7,0,9,0],[19,1,19,3],[22,1,22,3],[23,1,23,3],[20,1,20,3],[21,1,21,3],[27,1,27,3],[28,1,28,3],[24,8,27,8],[33,6,33,9],[32,1,32,3],[33,1,33,3],[28,6,28,9],[29,6,29,9],[30,6,30,9],[31,6,31,9],[29,1,29,3],[30,1,30,3],[31,1,31,3],[24,1,24,3],[25,1,25,3],[26,1,26,3],[38,1,38,3],[36,1,36,3],[34,6,34,9],[34,1,34,3],[35,1,35,3]]}
[]
[1,"Court/County",null,null,null,null,null,null,null,null,{"$f":"INDEX(Code!B1:B59,L2)","v":"Select court/county (see Contact Information worksheet #1)"},1]
[]
[2,"Court Contact:"]
[null,"Telephone Number:"]
[null,"E-mail Address:"]
[null,null,null," "]
[3,"County Contact:"]
{"$rows_left_out":36}
{"sheet":"ContactData","index":1,"n_rows":14,"n_cols":18,"rows_kept":14,"cut":false,"hidden":true,"merged":[]}
["Contact Information"]
["Court-County","CourtContact","CourtPhone","CourtEmail","CountyContact","CountyPhone","CountyEmail","Agency1","Agency2","Agency3","Agency4","Agency5"]
[{"$f":"'Contact and Other Information'!$K$2","v":"Select court/county (see Contact Information worksheet #1)"},{"$f":"IF('Contact and Other Information'!$C$4=\"\",\"N/A\",'Contact and Other Information'!$C$4)","v":"N/A"},{"$f":"IF('Contact and Other Information'!$C$5=\"\",\"N/A\",'Contact and Other Information'!$C$5)","v":"N/A"},{"$f":"IF('Contact and Other Information'!$C$6=\"\",\"N/A\",'Contact and Other Information'!$C$6)","v":"N/A"},{"$f":"IF('Contact and Other Information'!$C$8=\"\",\"N/A\",'Contact and Other Information'!$C$8)","v":"N/A"},{"$f":"IF('Contact and Other Information'!$C$9=\"\",\"N/A\",'Contact and Other Information'!$C$9)","v":"N/A"},{"$f":"IF('Contact and Other Information'!$C$10=\"\",\"N/A\",'Contact and Other Information'!$C$10)","v":"N/A"},{"$f":"IF('Contact and Other Information'!$K$12=\" \",\"N/A\",'Contact and Other Information'!$K$12)","v":"N/A"},{"$f":"IF('Contact and Other Information'!$K$13=\" \",\"N/A\",'Contact and Other Information'!$K$13)","v":"N/A"},{"$f":"IF('Contact and Other Information'!$K$14=\" \",\"N/A\",'Contact and Other Information'!$K$14)","v":"N/A"},{"$f":"IF('Contact and Other Information'!$K$15=\" \",\"N/A\",'Contact and Other Information'!$K$15)","v":"N/A"},{"$f":"IF('Contact and Other Information'!$K$16=\" \",\"N/A\",'Contact and Other Information'!$K$16)","v":"N/A"}]
[]
[]
["ActivityPerformed"]
["Activity1","Activity2","Activity3","Activity4","Activity5","Activity6","Activity7","Activity8","Activity9","Activity10","Activity11","Activity12","Activity13","Activity14","Activity15","Activity16","Comprehensive?","ActivityCount"]
[{"$f":"IF('Contact and Other Information'!$K$20=TRUE,1,0)","v":0},{"$f":"IF('Contact and Other Information'!$K$21=TRUE,1,0)","v":0},{"$f":"IF('Contact and Other Information'!$K$22=TRUE,1,0)","v":0},{"$f":"IF('Contact and Other Information'!$K$23=TRUE,1,0)","v":0},{"$f":"IF('Contact and Other Information'!$K$24=TRUE,1,0)","v":0},{"$f":"IF('Contact and Other Information'!$K$25=TRUE,1,0)","v":0},{"$f":"IF('Contact and Other Information'!$K$26=TRUE,1,0)","v":0},{"$f":"IF('Contact and Other Information'!$K$27=TRUE,1,0)","v":0},{"$f":"IF('Contact and Other Information'!$K$28=TRUE,1,0)","v":0},{"$f":"IF('Contact and Other Information'!$K$29=TRUE,1,0)","v":0},{"$f":"IF('Contact and Other Information'!$K$30=TRUE,1,0)","v":0},{"$f":"IF('Contact and Other Information'!$K$31=TRUE,1,0)","v":0},{"$f":"IF('Contact and Other Information'!$K$32=TRUE,1,0)","v":0},{"$f":"IF('Contact and Other Information'!$K$33=TRUE,1,0)","v":0},{"$f":"IF('Contact and Other Information'!$K$34=TRUE,1,0)","v":0},{"$f":"IF('Contact and Other Information'!$K$35=TRUE,1,0)","v":0},{"$f":"'Contact and Other Information'!$H$43","v":"No"},{"$f":"SUM(A8:P8)","v":0}]
{"$rows_left_out":7}
{"sheet":"Program","index":2,"n_rows":46,"n_cols":4,"rows_kept":46,"cut":false,"hidden":false,"merged":[[32,0,42,2],[27,0,27,2],[28,0,28,2],[29,0,29,2],[30,0,30,2],[31,0,31,2],[0,0,0,2],[1,0,1,2],[2,0,2,2],[3,0,3,2],[26,0,26,2]]}
[{"$f":"IF(TRIM('Contact and Other Information'!K2)=\"SELECT COURT/COUNTY\",\"Select court/county (see Contact Information worksheet #1)\",'Contact and Other Information'!K2)","v":"Select court/county (see Contact Information worksheet #1)"}]
["Use the space below to describe your collection program."]
[]
["Describe the extent to which your collection program is meeting the Judicial Council approved Collections Best Practices and identify any obstacles or problems that prevent the collections program from meeting those objectives. Of the twenty-two (22) Best Practices listed below please check those which your collection program has implemented. Provide an explanation for the best practices currently not being met, below. Also, identify any new or additional practices that have improved your collections program. "]
[null,1,"Develop plan and put in a written MOU that implements and enhances a program in which the court/county collaborate to collect court-ordered debt and monies owed to a court under court order.",false]
[null,2,"Establish and maintain a cooperative superior court and county collection committee responsible for compliance, reporting, and internal enhancements of the joint collection program.",false]
[null,3,"Meet the components of a comprehensive collection program as required under Penal Code section 1463.007 in order that the costs of operating the program can be recovered.",false]
[null,4,"Complete all data components in the Collections Reporting Template.",false]
{"$rows_left_out":39}
{"sheet":"ProgramData","index":3,"n_rows":12,"n_cols":26,"rows_kept":12,"cut":false,"hidden":true,"merged":[[5,0,5,1]]}
["BestPractices",null,null,null,null,null,null,null,null,null,null,null,null,null,null,null,null,null,null,null,null,null,null,null,null,"BPReport"]
["BP1","BP2","BP3","BP4","BP5","BP6","BP7","BP8","BP9","BP10","BP11","BP12","BP13","BP14","BP15","BP16","BP17","BP18","BP19","BP20","BP21","BP22","BPCount",null,"How Many","NotMet"]
[{"$f":"IF(Program!$D$5=TRUE,1,0)","v":0},{"$f":"IF(Program!$D$6=TRUE,1,0)","v":0},{"$f":"IF(Program!$D$7=TRUE,1,0)","v":0},{"$f":"IF(Program!$D$8=TRUE,1,0)","v":0},{"$f":"IF(Program!$D$9=TRUE,1,0)","v":0},{"$f":"IF(Program!$D$10=TRUE,1,0)","v":0},{"$f":"IF(Program!$D$11=TRUE,1,0)","v":0},{"$f":"IF(Program!$D$12=TRUE,1,0)","v":0},{"$f":"IF(Program!$D$13=TRUE,1,0)","v":0},{"$f":"IF(Program!$D$14=TRUE,1,0)","v":0},{"$f":"IF(Program!$D$15=TRUE,1,0)","v":0},{"$f":"IF(Program!$D$16=TRUE,1,0)","v":0},{"$f":"IF(Program!$D$17=TRUE,1,0)","v":0},{"$f":"IF(Program!$D$18=TRUE,1,0)","v":0},{"$f":"IF(Program!$D$19=TRUE,1,0)","v":0},{"$f":"IF(Program!$D$20=TRUE,1,0)","v":0},{"$f":"IF(Program!$D$21=TRUE,1,0)","v":0},{"$f":"IF(Program!$D$22=TRUE,1,0)","v":0},{"$f":"IF(Program!$D$23=TRUE,1,0)","v":0},{"$f":"IF(Program!$D$24=TRUE,1,0)","v":0},{"$f":"IF(Program!$D$25=TRUE,1,0)","v":0},{"$f":"IF(Program!$D$26=TRUE,1,0)","v":0},{"$f":"SUM(A3:V3)","v":0},null,{"$f":"Program!C45","v":"Meets 0 of the 22 recommended collections best practices."},{"$f":"Program!C46","v":"The following best practices are currently not being met:  1, 2, 3, 4, 5, 6, 7, 8, 9, 10, 11, 12, 13, 14, 15, 16, 17, 18, 19, 20, 21, and 22"}]
[]
[]
["TrainingRequested"]
["TRN-AuditJC","TRN-AuditSCO","TRN-RevDist","TRN-Discharge","TRN-Adjustments","TRN-ATP","TRN-CostRcvy","TRN-Other"]
[{"$f":"IF(Program!$D$28=TRUE,1,0)","v":0},{"$f":"IF(Program!$D$29=TRUE,1,0)","v":0},{"$f":"IF(Program!$D$30=TRUE,1,0)","v":0},{"$f":"IF(Program!$D$31=TRUE,1,0)","v":0},{"$f":"IF(Program!$D$32=TRUE,1,0)","v":0},{"$f":"IF(Program!$D$33=TRUE,1,0)","v":0},{"$f":"IF(Program!$D$34=TRUE,1,0)","v":0},{"$f":"IF(Program!$D$35=TRUE,1,0)","v":0}]
{"$rows_left_out":5}
{"sheet":"Performance","index":4,"n_rows":33,"n_cols":1,"rows_kept":33,"cut":false,"hidden":false,"merged":[[17,0,31,0],[33,0,55,0],[4,0,15,0]]}
[{"$f":"IF(TRIM('Contact and Other Information'!K2)=\"SELECT COURT/COUNTY\",\"Select court/county (see Contact Information worksheet #1)\",'Contact and Other Information'!K2)","v":"Select court/county (see Contact Information worksheet #1)"}]
["Use the space below to discuss your collection program."]
[]
["Please provide any comments on your performance for the reporting period, by Current Period, Prior Period Inventory, and Combined, that you wish included in the Individual Program Report that will be attached in the Report to the Legislature."]
[]
[]
[]
[]
{"$rows_left_out":26}
{"sheet":"PerformanceData","index":5,"n_rows":6,"n_cols":3,"rows_kept":6,"cut":false,"hidden":true,"merged":[]}
["Question1","Question2","Question3"]
[{"$f":"IF(Performance!$A$5=\"\",\"N/A\",Performance!A$5)","v":"N/A"},{"$f":"IF(Performance!$A$18=\"\",\"N/A\",Performance!A$18)","v":"N/A"},{"$f":"IF(Performance!$A$34=\"\",\"N/A\",Performance!A$34)","v":"N/A"}]
[]
[]
["DashboardComment"]
[{"$f":"IF('Performance Metrics'!$A$30=\"\",\"N/A\",'Performance Metrics'!A$30)","v":"N/A"}]

{"sheet":"Annual Financial Report","index":6,"n_rows":68,"n_cols":13,"rows_kept":68,"cut":false,"hidden":false,"merged":[[47,0,47,12],[67,0,67,1],[67,7,67,8],[30,11,30,12],[31,11,31,12],[32,11,32,12],[33,11,33,12],[34,11,34,12],[35,11,35,12],[36,11,36,12],[38,11,38,12],[39,11,39,12],[40,11,40,12],[41,0,41,12],[37,11,37,12],[29,0,29,12],[2,1,2,2],[3,1,3,2],[4,1,4,2],[5,0,5,12],[17,0,17,12]]}
[null,{"$f":"IF(TRIM('Contact and Other Information'!K2)=\"SELECT COURT/COUNTY\",\"Select court/county (see Contact Information worksheet #1)\",'Contact and Other Information'!K2)","v":"Select court/county (see Contact Information worksheet #1)"}]
[]
[null,"REPORTING PERIOD",null,"Col. A"]
[1,"Beginning Date-First day of Reporting Period",null,"2022-07-01"]
[2,"Ending Date-Last day of Reporting Period",null,"2023-06-30"]
["CURRENT PERIOD (NEWLY-ESTABLISHED) DELINQUENT DEBT: FINES, FEES, FORFEITURES, PENALTIES AND ASSESSMENTS"]
[null,null,"Number of Cases Established or Referred as Delinquent","Value of Cases Established or Referred as Delinquent","Number of Cases with Payment(s) Received                             (Items 1 and 2)      ","Gross Revenue Collected            ","Cost of Collections\n(Penal Code 1463.007)\nenter as negative number","Adjustment: Amount satisfied by Court-ordered Suspension, Dismissal or Alternative Sentence \n(Item 3)","Discharge from Accountability     \n(Item 3)","Net Value of Newly-Established Delinquent Debt at End of Period\n(Col. C - E  - G - H) ","Value of Cases on Installment Agreement                 (Item 8)","Default Balance Installment Agreement        \n(Item 8)","Percentage of Debt Defaulted On \n(Installment Agmt.)                    (Col. K / Col. J) "]
["Row","Program","Col. B","Col. C","Col. D","Col. E","Col. F","Col. G","Col. H","Col. I","Col. J","Col. K","Col. L"]
{"$rows_left_out":61}
{"sheet":"AFRData","index":7,"n_rows":54,"n_cols":11,"rows_kept":54,"cut":false,"hidden":true,"merged":[]}
["NonDelinquent"]
["NDCurrentCases","NDCurrentValue","NDPriorCases","NDPriorValue","NDTotalCases","NDTotalValue","Restitution"]
[{"$f":"IF('Annual Financial Report'!$E$9=\"\",\"\",'Annual Financial Report'!$E$9)","v":""},{"$f":"IF('Annual Financial Report'!$F$9=\"\",\"\",'Annual Financial Report'!$F$9)","v":""},{"$f":"IF('Annual Financial Report'!$E$21=\"\",\"\",'Annual Financial Report'!$E$21)","v":""},{"$f":"IF('Annual Financial Report'!$F$21=\"\",\"\",'Annual Financial Report'!$F$21)","v":""},{"$f":"IF(SUM(A3,C3)=0,\"\",SUM(A3,C3))","v":""},{"$f":"IF(SUM(B3,D3)=0,\"\",SUM(B3,D3))","v":""},{"$f":"IF('Annual Financial Report'!$G$51=\"\",\"\",'Annual Financial Report'!$G$51)","v":""}]
[]
[]
["Current","CasesBeginning","ValueBeginning","CasesPaid","Revenue","Administrative Cost","Adjustments","Discharge","Installment","Default"]
["Court",{"$f":"IF('Annual Financial Report'!$C$10=\"\",\"\",'Annual Financial Report'!$C$10)","v":""},{"$f":"IF('Annual Financial Report'!$D$10=\"\",\"\",'Annual Financial Report'!$D$10)","v":""},{"$f":"IF('Annual Financial Report'!$E$10=\"\",\"\",'Annual Financial Report'!$E$10)","v":""},{"$f":"IF('Annual Financial Report'!$F$10=\"\",\"\",'Annual Financial Report'!$F$10)","v":""},{"$f":"IF('Annual Financial Report'!$G$10=\"\",\"\",'Annual Financial Report'!$G$10)","v":""},{"$f":"IF('Annual Financial Report'!$H$10=\"\",\"\",'Annual Financial Report'!$H$10)","v":""},{"$f":"IF('Annual Financial Report'!$I$10=\"\",\"\",'Annual Financial Report'!$I$10)","v":""},{"$f":"IF('Annual Financial Report'!$K$10=\"\",\"\",'Annual Financial Report'!$K$10)","v":""},{"$f":"IF('Annual Financial Report'!$L$10=\"\",\"\",'Annual Financial Report'!$L$10)","v":""}]
["County",{"$f":"IF('Annual Financial Report'!$C$11=\"\",\"\",'Annual Financial Report'!$C$11)","v":""},{"$f":"IF('Annual Financial Report'!$D$11=\"\",\"\",'Annual Financial Report'!$D$11)","v":""},{"$f":"IF('Annual Financial Report'!$E$11=\"\",\"\",'Annual Financial Report'!$E$11)","v":""},{"$f":"IF('Annual Financial Report'!$F$11=\"\",\"\",'Annual Financial Report'!$F$11)","v":""},{"$f":"IF('Annual Financial Report'!$G$11=\"\",\"\",'Annual Financial Report'!$G$11)","v":""},{"$f":"IF('Annual Financial Report'!$H$11=\"\",\"\",'Annual Financial Report'!$H$11)","v":""},{"$f":"IF('Annual Financial Report'!$I$11=\"\",\"\",'Annual Financial Report'!$I$11)","v":""},{"$f":"IF('Annual Financial Report'!$K$11=\"\",\"\",'Annual Financial Report'!$K$11)","v":""},{"$f":"IF('Annual Financial Report'!$L$11=\"\",\"\",'Annual Financial Report'!$L$11)","v":""}]
{"$rows_left_out":47}
{"sheet":"Performance Metrics","index":8,"n_rows":29,"n_cols":4,"rows_kept":29,"cut":false,"hidden":false,"merged":[[29,0,35,2],[22,0,23,0],[19,0,20,0],[16,0,17,0],[2,0,3,0],[28,0,28,2]]}
[]
[]
["Collector Effective Index","Current","Prior"]
[null,{"$f":"IFERROR('Annual Financial Report'!E17/'Annual Financial Report'!C17, \"\")","v":""},{"$f":"IFERROR('Annual Financial Report'!E29/'Annual Financial Report'!C29, \"\")","v":""}]
[]
["First Year Resolution Rate",{"$f":"IFERROR(1-('Annual Financial Report'!J17/'Annual Financial Report'!D17),\"\")","v":""}]
[]
["Spend Efficiency Score","Current","Prior","Combined"]
{"$rows_left_out":22}
{"sheet":"Quality Checklist ","index":9,"n_rows":55,"n_cols":16,"rows_kept":55,"cut":false,"hidden":false,"merged":[[38,2,38,13],[39,2,39,13],[40,2,40,13],[41,2,41,13],[44,2,44,13],[42,2,42,13],[43,2,43,13],[45,2,45,13],[54,2,54,13],[15,0,15,13],[28,0,28,13],[46,0,46,13],[22,2,22,13],[21,2,21,13],[20,2,20,13],[53,2,53,13],[52,2,52,13],[27,2,27,13],[30,2,30,13],[51,2,51,13],[50,2,50,13],[49,2,49,13],[34,2,34,13],[48,2,48,13],[0,2,0,13],[32,2,32,13],[33,2,33,13],[25,2,25,13],[2,2,2,13],[3,2,3,13],[1,2,1,13],[24,2,24,13],[23,2,23,13],[26,2,26,13],[29,2,29,13],[4,2,4,13],[31,2,31,13],[6,2,6,13],[5,2,5,13],[7,2,7,13],[14,2,14,13],[10,2,10,13],[47,2,47,13],[18,2,18,13],[19,2,19,13],[8,2,8,13],[9,2,9,13],[16,2,16,13],[11,2,11,13],[12,2,12,13],[13,2,13,13],[17,2,17,13],[35,0,35,13],[36,2,36,13],[37,2,37,13]]}
["Row","Quality Checklist","CURRENT PERIOD: FINES, FEES, FORFEITURES, PENALTIES AND ASSESSMENTS"]
[1,null,"Row 3, Column D, includes revenues collected for non-delinquent infraction, misdemeanor, and felony cases that were paid in full on or before the due date, or current installment or accounts receivable (A/R) payment plan. Row 3, Column E includes the number of cases associated with non-delinquent revenue collections reported in Row 3, Column D.",null,null,null,null,null,null,null,null,null,null,null,false]
[2,null,"Rows 4-10 include all fines, fees, forfeitures, penalties, and assessments on traffic, criminal, and juvenile delinquency case types (infraction, misdemeanors, and felony), except victim restitution (see Rows 33-41 for more information).",null,null,null,null,null,null,null,null,null,null,null,false]
[3,null,"Rows 4-10, include newly established/referred/transferred cases, gross revenue collected, adjustments, or discharges posted during the reporting period. ",null,null,null,null,null,null,null,null,null,null,null,false]
[4,null,"Rows 4-10, Column B, include the total number of new cases established, referred, or transferred within the reporting period. Any cases that were previously established, but never referred or transferred to collections, are considered new cases and should be reported in this column (the corresponding value of these cases should be reported in Column C). If multiple cases were bundled into one case, only one (1) case should be reported in Column B.",null,null,null,null,null,null,null,null,null,null,null,false]
[5,null,"Rows 4-10, Column C, include the total value of the corresponding cases in Column B, that were established, referred, or transferred during the reporting period only.         ",null,null,null,null,null,null,null,null,null,null,null,false]
[6,null,"Rows 4-10, Column D, include the number of cases with payment(s) received during the reporting period. The number of cases reported may be equal to but not greater than the number of cases established in Column B. ",null,null,null,null,null,null,null,null,null,null,null,false]
[7,null,"Rows 4-10, Column E, include all monies received towards the satisfaction of delinquent court-ordered debt, including installment payments. ",null,null,null,null,null,null,null,null,null,null,null,false]
{"$rows_left_out":48}
{"sheet":"Transfer Worksheet","index":10,"n_rows":15,"n_cols":7,"rows_kept":15,"cut":false,"hidden":false,"merged":[]}
[]
[]
[]
[]
[null,"Number of Delinquent Cases at Period Beginning \n(Ending Balance from Prior Year – Col. AE)","Value of Delinquent Cases at Period Beginning\n(Ending Balance from Prior Year – Col. AF)","Number of Cases Transferred Between Programs","Value of Cases Transferred Between Programs","Adjusted Number of Delinquent Cases at Period Beginning \n(Enter in Col. M)","Adjusted Value of Delinquent Cases at Period Beginning\n(Enter in Col. N)"]
["Program","Col. 1","Col. 2","Col. 3","Col. 4","Col. M","Col. N"]
["Non-Delinquent Collections"]
["Court Collection Program",null,null,null,null,{"$f":"SUM(B8+D8)","v":0},{"$f":"SUM(C8+E8)","v":0}]
{"$rows_left_out":8}
{"sheet":"Categories","index":11,"n_rows":24,"n_cols":3,"rows_kept":24,"cut":false,"hidden":false,"merged":[[23,0,23,2],[21,1,22,1]]}
[]
["PC 1463.007 Collections Activity","Category"," Task/Activity "]
[]
["3a. Attempts telephone contact with delinquent debtors for whom the program has a telephone number ",null,"Outbound Call\nInbound Call "]
[null,"1= Telephone Contact"]
["k. Uses an automated dialer or automatic call distribution system to manage telephone calls.",null,"Dialer blast messaging "]
["3b. Notifies delinquent debtors for whom the program has an address in writing of their outstanding obligation within 95 days of delinquency. ",null,"Delinquent Notice (Failure to Appear or Failure to Pay) \nHandle all collections-related mail correspondence                                        \nE-mail received  \nEmail sent                                     "]
[null,"2=Written Notice(s)"]
{"$rows_left_out":17}
{"sheet":"Code","index":12,"n_rows":59,"n_cols":7,"rows_kept":59,"cut":false,"hidden":true,"merged":[]}
["Not Selected","Select court/county (see Contact Information worksheet #1)",null,null,null,null," "]
["C010000","Court/County - Alameda",null,null,null,null,"County"]
["C020000","Court/County - Alpine",null,null,null,null,"Court"]
["C030000","Court/County - Amador",null,null,null,null,"Private Agency"]
["C040000","Court/County - Butte",null,null,null,null,"FTB-COD"]
["C050000","Court/County - Calaveras",null,null,null,null,"Intra-branch"]
["C060000","Court/County - Colusa",null,null,null,null,"None"]
["C070000","Court/County - Contra Costa"]
{"$rows_left_out":52}
{"sheet":"Best Practices","index":13,"n_rows":29,"n_cols":4,"rows_kept":29,"cut":false,"hidden":true,"merged":[]}
[]
[1,{"$f":"Program!D5","v":false},null,{"$f":"IF($B$2=FALSE,IF(COUNTIF($B$3:$B$23,TRUE)>=21,\" 1\",\" 1,\"),\"\")","v":" 1,"}]
[2,{"$f":"Program!D6","v":false},null,{"$f":"IF($B$3=FALSE,IF(COUNTIF($B$4:$B$23,TRUE)=20,IF(COUNTIF($B$2,TRUE)<1,\" and 2\",\" 2\"),\" 2,\"),\"\")","v":" 2,"}]
[3,{"$f":"Program!D7","v":false},null,{"$f":"IF($B$4=FALSE,IF(COUNTIF($B$5:$B$23,TRUE)=19,IF(COUNTIF($B$2:$B$3,TRUE)<2,\" and 3\",\" 3\"),\" 3,\"),\"\")","v":" 3,"}]
[4,{"$f":"Program!D8","v":false},null,{"$f":"IF($B$5=FALSE,IF(COUNTIF($B$6:$B$23,TRUE)=18,IF(COUNTIF($B$2:$B$4,TRUE)<3,\" and 4\",\" 4\"),\" 4,\"),\"\")","v":" 4,"}]
[5,{"$f":"Program!D9","v":false},null,{"$f":"IF($B$6=FALSE,IF(COUNTIF($B$7:$B$23,TRUE)=17,IF(COUNTIF($B$2:$B$5,TRUE)<4,\" and 5\",\" 5\"),\" 5,\"),\"\")","v":" 5,"}]
[6,{"$f":"Program!D10","v":false},null,{"$f":"IF($B$7=FALSE,IF(COUNTIF($B$8:$B$23,TRUE)=16,IF(COUNTIF($B$2:$B$6,TRUE)<5,\" and 6\",\" 6\"),\" 6,\"),\"\")","v":" 6,"}]
[7,{"$f":"Program!D11","v":false},null,{"$f":"IF($B$8=FALSE,IF(COUNTIF($B9:$B$23,TRUE)=15,IF(COUNTIF($B$2:$B7,TRUE)<6,\" and 7\",\" 7\"),\" 7,\"),\"\")","v":" 7,"}]
{"$rows_left_out":21}